comment
IRC Chat
play_arrow
Este sitio utiliza cookies propias y de terceros. Si continúa navegando consideramos que acepta el uso de cookies. OK Más Información.

Kivy no compila a apk error hardwareacelerometer.

  • 0 Respuestas
  • 1039 Vistas

0 Usuarios y 1 Visitante están viendo este tema.

Desconectado $francisco

  • *
  • Underc0der
  • Mensajes: 191
  • Actividad:
    0%
  • Reputación 0
    • Ver Perfil
    • Email
  • Skype: hackloper
« en: Septiembre 06, 2014, 02:05:30 pm »
Que tal a todos, comento que paso, tuve que formatear mi OS donde tenia kivy instalado, he vuelta ha seguir los mismos pasos, tengo instalado android ndk r8c, insatalado android sdk que viene con eclipse, instaladas las APIS 8 y 14, exporto las siguientes variables.

Código: No tienes permisos para ver links. Registrate o Entra con tu cuenta
export ANDROIDSDK=/root/android-sdks/
export ANDROIDNDK=/opt/android-ndk-r8c
export ANDROIDNDKVER="r8c"
./distribute -m "kivy"

se generan todos los archivos necesarios para la compilación. me dirijo a el archivo build.py y ejecuto

Código: No tienes permisos para ver links. Registrate o Entra con tu cuenta
python build.py --dir ~/project/program/ --name programa --version 1.0 --packcage org.francisco.programa debug
y me genera el siguiente error

Código: No tienes permisos para ver links. Registrate o Entra con tu cuenta
[aapt] /root/python-for-android/dist/default/bin/AndroidManifest.xml:17: error: No resource identifier found for attribute 'hardwareAccelerated' in package 'android'

BUILD FAILED
/root/android-sdks/tools/ant/build.xml:653: The following error occurred while executing this line:
/root/android-sdks/tools/ant/build.xml:698: null returned: 1

Total time: 3 seconds
Traceback (most recent call last):
  File "./build.py", line 491, in <module>
    make_package(args)
  File "./build.py", line 354, in make_package
    subprocess.check_call([ANT, arg])
  File "/usr/lib/python2.7/subprocess.py", line 511, in check_call
    raise CalledProcessError(retcode, cmd)
subprocess.CalledProcessError: Command '['ant', 'debug']' returned non-zero exit status 1

El archivo Manifiest.xml que yo sepa no se puede modificar, antes me funcionaba,  y la verdad llevo todo el dia intentando hacer funcionar y no lo logro, agradecería ayuda para poder hacerlo funcionar y poder seguir con mis programas.gracias.
« Última modificación: Septiembre 06, 2014, 03:01:27 pm por Expermicid »

 

¿Te gustó el post? COMPARTILO!



Error con ffmpeg en android con android studio

Iniciado por $francisco

Respuestas: 6
Vistas: 2350
Último mensaje Mayo 16, 2015, 12:52:46 pm
por $francisco
Error "modo Monitor" TL-WN722N

Iniciado por L€XN0

Respuestas: 10
Vistas: 1285
Último mensaje Mayo 31, 2018, 08:36:34 pm
por K A I L
Error al abrir cualquier sistema operativo dese usb: "Failed to find cpu0 node"

Iniciado por thecloudff7

Respuestas: 12
Vistas: 4196
Último mensaje Febrero 14, 2016, 05:10:47 pm
por thecloudff7
No me funciona el exploit por error de sintaxis (DirtyCow u otro exploit.c)

Iniciado por banderas20

Respuestas: 5
Vistas: 417
Último mensaje Septiembre 13, 2018, 03:30:01 pm
por banderas20
¡AYUDA! Error al instalar cualquier aplicacion vía "Apt-Get"

Iniciado por iGreentick

Respuestas: 5
Vistas: 1620
Último mensaje Octubre 13, 2016, 01:44:28 am
por puntoCL