Error en test de QA

  • 4 Respuestas
  • 331 Vistas

0 Usuarios y 1 Visitante están viendo este tema.

Desconectado LoKogan

  • *
  • Underc0der
  • Mensajes: 5
  • Actividad:
    16.67%
  • Country: ar
  • Reputación 0
    • Ver Perfil

Error en test de QA

  • en: Septiembre 13, 2020, 06:42:00 pm
Buenas ,tengo este error cuando corro el código de testeo y no tengo idea a qué se refiere

 When realizo una petición 'POST' a 'ANALYSIS' al endpoint de analisis - 'request/cat_analisis' # CatSteps.realizoUnaPeticiónOperationAEntityAlEndpoi
ntDeAnalisisRequest(String,String,String)
      java.lang.NoSuchMethodException: services.AnalisisService.post(api.model.Analysis)
        at java.base/java.lang.Class.getMethod(Class.java:2108)
        at ar.steps.CatSteps.realizoUnaPeticiónOperationAEntityAlEndpointDeAnalisisRequest(CatSteps.java:59)
        at ?.realizo una petición 'POST' a 'ANALYSIS' al endpoint de analisis - 'request/cat_analisis'(file:src/test/resources/features/cat_categories.f
eature:22)

    Then obtengo el status code '401'                                                              # CatSteps.obtengoElStatusCodeStatusCode(int)
[ERROR] Tests run: 1, Failures: 1, Errors: 0, Skipped: 0, Time elapsed: 3.049 s <<< FAILURE! - in TestSuite
[ERROR] ApiExampleProjectTestRunner.runScenario  Time elapsed: 1.24 s  <<< FAILURE!
java.lang.NoSuchMethodException: services.AnalisisService.post(api.model.Analysis)

[INFO]
[INFO] Results:
[INFO]
[ERROR] Failures:
[ERROR]   ApiExampleProjectTestRunner.runScenario » NoSuchMethod services.AnalisisServic...
[INFO]
[ERROR] Tests run: 1, Failures: 1, Errors: 0, Skipped: 0
[INFO]
[WARNING] Could not delete temp directory C:\Users\Usuario\AppData\Local\Temp\surefire9777909246201055538 because Directory C:\Users\Usuario\AppData\Loc
al\Temp\surefire9777909246201055538 unable to be deleted.
[INFO] ------------------------------------------------------------------------
[INFO] BUILD FAILURE
[INFO] ------------------------------------------------------------------------
[INFO] Total time:  17.420 s
[INFO] Finished at: 2020-09-13T18:40:55-03:00
[INFO] ------------------------------------------------------------------------
[ERROR] Failed to execute goal org.apache.maven.plugins:maven-surefire-plugin:3.0.0-M4:test (default-test) on project lippia-api-example-project: There
are test failures.
[ERROR]
[ERROR] Please refer to D:\UTN\Autodidacta\Crowdar\Lippia-API-sample-project-master\target\surefire-reports for the individual test results.
[ERROR] Please refer to dump files (if any exist) [date].dump, [date]-jvmRun[N].dump and [date].dumpstream.
[ERROR] -> [Help 1]
[ERROR]
[ERROR] To see the full stack trace of the errors, re-run Maven with the -e switch.
[ERROR] Re-run Maven using the -X switch to enable full debug logging.
[ERROR]
[ERROR] For more information about the errors and possible solutions, please read the following articles:
[ERROR] [Help 1] You are not allowed to view links. Register or Login
"cmd" no se reconoce como un comando interno o externo,
programa o archivo por lotes ejecutable.

« Última modificación: Septiembre 13, 2020, 10:54:42 pm por Gabriela »

Conectado ANTRAX

  • *
  • Administrator
  • Mensajes: 5702
  • Actividad:
    76.67%
  • Country: ar
  • Reputación 37
  • ANTRAX
  • Skype: underc0de.org
  • Twitter: @Underc0de
    • Ver Perfil
    • Underc0de
    • Email

Re:Error en test de QA

  • en: Septiembre 13, 2020, 06:58:43 pm
Hola @You are not allowed to view links. Register or Login
Como estas ejecutando los tests?

Saludos



Desconectado LoKogan

  • *
  • Underc0der
  • Mensajes: 5
  • Actividad:
    16.67%
  • Country: ar
  • Reputación 0
    • Ver Perfil

Re:Error en test de QA

  • en: Septiembre 13, 2020, 07:07:52 pm
mvn -P academy "[email protected]" test
con esa instrucción, no se si responde a tu pregunta..

Conectado ANTRAX

  • *
  • Administrator
  • Mensajes: 5702
  • Actividad:
    76.67%
  • Country: ar
  • Reputación 37
  • ANTRAX
  • Skype: underc0de.org
  • Twitter: @Underc0de
    • Ver Perfil
    • Underc0de
    • Email

Re:Error en test de QA

  • en: Septiembre 14, 2020, 07:34:26 am
Proba dandole click derecho al testng.xml y ponele RUN.
Es otra forma de correrlo, como para ir descartando.

Saludos!


Desconectado LoKogan

  • *
  • Underc0der
  • Mensajes: 5
  • Actividad:
    16.67%
  • Country: ar
  • Reputación 0
    • Ver Perfil

Re:Error en test de QA

  • en: Septiembre 14, 2020, 12:41:29 pm
Me sigue tirando el mismo error, aparentemente está en esta linea

 @When("realizo una petición '(.*)' a '(.*)' al endpoint de analisis - '(.*)'")
    public void realizoUnaPeticiónOperationAEntityAlEndpointDeAnalisisRequest(String operation, String entity, String request) throws NoSuchMethodException, InvocationTargetException, IllegalAccessException {
        EntityConfiguration.valueOf(entity).getEntityService().
                getMethod(operation.toLowerCase(), Analysis.class)
                .invoke("", request);

    }
}
pero no entiendo por qué si está igual a las otras

 

Error con ffmpeg en android con android studio

Iniciado por $francisco

Respuestas: 6
Vistas: 5030
Último mensaje Mayo 16, 2015, 12:52:46 pm
por $francisco
Error "modo Monitor" TL-WN722N

Iniciado por L€XN0

Respuestas: 11
Vistas: 9575
Último mensaje Junio 03, 2020, 12:44:56 am
por chevin
Error al abrir cualquier sistema operativo dese usb: "Failed to find cpu0 node"

Iniciado por thecloudff7

Respuestas: 14
Vistas: 8039
Último mensaje Agosto 07, 2020, 07:07:01 am
por Laststock777
¡AYUDA! Error al instalar cualquier aplicacion vía "Apt-Get"

Iniciado por iGreentick

Respuestas: 5
Vistas: 3689
Último mensaje Octubre 13, 2016, 01:44:28 am
por puntoCL
No me funciona el exploit por error de sintaxis (DirtyCow u otro exploit.c)

Iniciado por banderas20

Respuestas: 5
Vistas: 2638
Último mensaje Septiembre 13, 2018, 03:30:01 pm
por banderas20